Skip to content

[NU-1823] Fix for schemaless topics in kafka source/sink #15628

[NU-1823] Fix for schemaless topics in kafka source/sink

[NU-1823] Fix for schemaless topics in kafka source/sink #15628

Triggered via pull request November 29, 2024 08:40
@ForrestFairyForrestFairy
synchronize #7232
Status Success
Total duration 12s
Artifacts

labeler.yml

on: pull_request_target
Fit to window
Zoom out
Zoom in

Annotations

8 errors
pl.touk.nussknacker.BatchDataGenerationSpec ► Generate file endpoint for scenario with table source should generate randomized records when configured with random mode: e2e-tests/src/test/scala/pl/touk/nussknacker/BatchDataGenerationSpec.scala#L50
Failed test found in: e2e-tests/target/test-reports/TEST-pl.touk.nussknacker.BatchDataGenerationSpec.xml Error: java.lang.AssertionError: 1 expectation failed.
pl.touk.nussknacker.BatchDataGenerationSpec ► Generate file endpoint for scenario with table source should generate live records from data source with default configuration: e2e-tests/src/test/scala/pl/touk/nussknacker/BatchDataGenerationSpec.scala#L75
Failed test found in: e2e-tests/target/test-reports/TEST-pl.touk.nussknacker.BatchDataGenerationSpec.xml Error: java.lang.AssertionError: 1 expectation failed.
pl.touk.nussknacker.BatchDataGenerationSpec ► Test on generated data endpoint should return results and counts for scenario with table source: e2e-tests/src/test/scala/pl/touk/nussknacker/BatchDataGenerationSpec.scala#L102
Failed test found in: e2e-tests/target/test-reports/TEST-pl.touk.nussknacker.BatchDataGenerationSpec.xml Error: java.lang.AssertionError: 1 expectation failed.
pl.touk.nussknacker.BatchDataGenerationSpec ► Test from file endpoint should return results and counts for scenario with table source: e2e-tests/src/test/scala/pl/touk/nussknacker/BatchDataGenerationSpec.scala#L179
Failed test found in: e2e-tests/target/test-reports/TEST-pl.touk.nussknacker.BatchDataGenerationSpec.xml Error: java.lang.AssertionError: 1 expectation failed.
pl.touk.nussknacker.BatchDataGenerationSpec ► Generate file endpoint for scenario with table source should generate randomized records when configured with random mode: e2e-tests/src/test/scala/pl/touk/nussknacker/BatchDataGenerationSpec.scala#L50
Failed test found in: e2e-tests/target/test-reports/TEST-pl.touk.nussknacker.BatchDataGenerationSpec.xml Error: java.lang.AssertionError: 1 expectation failed.
pl.touk.nussknacker.BatchDataGenerationSpec ► Generate file endpoint for scenario with table source should generate live records from data source with default configuration: e2e-tests/src/test/scala/pl/touk/nussknacker/BatchDataGenerationSpec.scala#L75
Failed test found in: e2e-tests/target/test-reports/TEST-pl.touk.nussknacker.BatchDataGenerationSpec.xml Error: java.lang.AssertionError: 1 expectation failed.
pl.touk.nussknacker.BatchDataGenerationSpec ► Test on generated data endpoint should return results and counts for scenario with table source: e2e-tests/src/test/scala/pl/touk/nussknacker/BatchDataGenerationSpec.scala#L102
Failed test found in: e2e-tests/target/test-reports/TEST-pl.touk.nussknacker.BatchDataGenerationSpec.xml Error: java.lang.AssertionError: 1 expectation failed.
pl.touk.nussknacker.BatchDataGenerationSpec ► Test from file endpoint should return results and counts for scenario with table source: e2e-tests/src/test/scala/pl/touk/nussknacker/BatchDataGenerationSpec.scala#L179
Failed test found in: e2e-tests/target/test-reports/TEST-pl.touk.nussknacker.BatchDataGenerationSpec.xml Error: java.lang.AssertionError: 1 expectation failed.