Skip to content

potential fix

potential fix #20971

Triggered via push October 16, 2024 10:55
Status Failure
Total duration 48m 25s
Artifacts 8

pr.yml

on: push
Matrix: IntegrationTests
Matrix: SlowTests
Matrix: Tests
publish
0s
publish
Matrix: trigger-external-build
Fit to window
Zoom out
Zoom in

Annotations

9 errors and 10 warnings
SlowTests (2.12)
Process completed with exit code 1.
SlowTests (2.13)
The job was canceled because "_2_12" failed.
SlowTests (2.13)
The operation was canceled.
Tests (2.13)
Process completed with exit code 1.
Tests (2.12)
The job was canceled because "_2_13" failed.
Tests (2.12)
The operation was canceled.
pl.touk.nussknacker.ui.api.ManagementResourcesConcurrentSpec ► not allow concurrent deployment of same process: designer/server/src/test/scala/pl/touk/nussknacker/ui/api/ManagementResourcesConcurrentSpec.scala#L53
Failed test found in: designer/server/target/test-reports/TEST-pl.touk.nussknacker.ui.api.ManagementResourcesConcurrentSpec.xml Error: org.scalatest.exceptions.TestFailedException: List(200 OK, 200 OK) did not contain only (200 OK, 409 Conflict)
pl.touk.nussknacker.ui.api.ManagementResourcesConcurrentSpec ► not allow concurrent deployment of same process: designer/server/src/test/scala/pl/touk/nussknacker/ui/api/ManagementResourcesConcurrentSpec.scala#L53
Failed test found in: designer/server/target/test-reports/TEST-pl.touk.nussknacker.ui.api.ManagementResourcesConcurrentSpec.xml Error: org.scalatest.exceptions.TestFailedException: List(200 OK, 200 OK) did not contain only (200 OK, 409 Conflict)
pl.touk.nussknacker.engine.management.periodic.PeriodicProcessServiceIntegrationTest ► should wait until other schedule finishes, before deploying next schedule: engine/flink/management/periodic/src/test/scala/pl/touk/nussknacker/engine/management/periodic/PeriodicProcessServiceIntegrationTest.scala#L376
Failed test found in: engine/flink/management/periodic/target/test-reports/TEST-pl.touk.nussknacker.engine.management.periodic.PeriodicProcessServiceIntegrationTest.xml Error: org.scalatest.exceptions.TestFailedException: Vector(PeriodicProcessDeployment(2, PeriodicProcess(PeriodicProcessId(1), DeploymentWithJarData(ProcessVersion(1, test, 1, List(), "", None), CanonicalProcess(MetaData("test", ProcessAdditionalFields(None, Map("parallelism" -> "", "spillStateToDisk" -> "true", "useAsyncInterpretation" -> "", "checkpointIntervalInSeconds" -> ""), "StreamMetaData", false)), List(), List()), "", ""), MultipleScheduleProperty(Map("schedule1" -> CronScheduleProperty("0 5 * * * ?"), "schedule2" -> CronScheduleProperty("0 5 * * * ?"))), true, 2021-04-06T13:18, Some(9fe184c9-8e69-46c4-97fa-ca9feb954ec1)), 2021-04-06T13:18, 2021-04-06T14:05, ScheduleName(Some("schedule2")), 0, None, PeriodicProcessDeploymentState(None, None, Scheduled)), PeriodicProcessDeployment(1, PeriodicProcess(PeriodicProcessId(1), DeploymentWithJarData(ProcessVersion(1, test, 1, List(), "", None), CanonicalProcess(MetaData("test", ProcessAdditionalFields(None, Map("parallelism" -> "", "spillStateToDisk" -> "true", "useAsyncInterpretation" -> "", "checkpointIntervalInSeconds" -> ""), "StreamMetaData", false)), List(), List()), "", ""), MultipleScheduleProperty(Map("schedule1" -> CronScheduleProperty("0 5 * * * ?"), "schedule2" -> CronScheduleProperty("0 5 * * * ?"))), true, 2021-04-06T13:18, Some(9fe184c9-8e69-46c4-97fa-ca9feb954ec1)), 2021-04-06T13:18, 2021-04-06T14:05, ScheduleName(Some("schedule1")), 0, None, PeriodicProcessDeploymentState(None, None, Scheduled))) had length 2 instead of expected length 1
setup
The following actions use a deprecated Node.js version and will be forced to run on node20: actions/checkout@v3, dorny/paths-filter@v2. For more info: https://github.blog/changelog/2024-03-07-github-actions-all-actions-will-run-on-node20-instead-of-node16-by-default/
FrontendTests
The following actions use a deprecated Node.js version and will be forced to run on node20: actions/checkout@v3, actions/cache@v3, actions/setup-node@v3, actions/upload-artifact@v3. For more info: https://github.blog/changelog/2024-03-07-github-actions-all-actions-will-run-on-node20-instead-of-node16-by-default/
BuildFrontend
The following actions use a deprecated Node.js version and will be forced to run on node20: actions/checkout@v3, actions/cache@v3, actions/setup-node@v3, actions/upload-artifact@v3. For more info: https://github.blog/changelog/2024-03-07-github-actions-all-actions-will-run-on-node20-instead-of-node16-by-default/
Build
The following actions use a deprecated Node.js version and will be forced to run on node20: actions/checkout@v3, actions/cache@v3, actions/upload-artifact@v3. For more info: https://github.blog/changelog/2024-03-07-github-actions-all-actions-will-run-on-node20-instead-of-node16-by-default/
SlowTests (2.12)
The following actions use a deprecated Node.js version and will be forced to run on node20: actions/checkout@v3, actions/cache@v3, actions/download-artifact@v3, actions/upload-artifact@v3. For more info: https://github.blog/changelog/2024-03-07-github-actions-all-actions-will-run-on-node20-instead-of-node16-by-default/
IntegrationTests (2.13)
The following actions use a deprecated Node.js version and will be forced to run on node20: actions/checkout@v3, actions/cache@v3, actions/download-artifact@v3, actions/upload-artifact@v3. For more info: https://github.blog/changelog/2024-03-07-github-actions-all-actions-will-run-on-node20-instead-of-node16-by-default/
IntegrationTests (2.12)
The following actions use a deprecated Node.js version and will be forced to run on node20: actions/checkout@v3, actions/cache@v3, actions/download-artifact@v3, actions/upload-artifact@v3. For more info: https://github.blog/changelog/2024-03-07-github-actions-all-actions-will-run-on-node20-instead-of-node16-by-default/
Tests (2.13)
The following actions use a deprecated Node.js version and will be forced to run on node20: actions/checkout@v3, actions/download-artifact@v3, actions/cache@v3, actions/upload-artifact@v3. For more info: https://github.blog/changelog/2024-03-07-github-actions-all-actions-will-run-on-node20-instead-of-node16-by-default/
CypressTests
The following actions use a deprecated Node.js version and will be forced to run on node20: actions/checkout@v3, actions/setup-node@v3, actions/download-artifact@v3, actions/upload-artifact@v3. For more info: https://github.blog/changelog/2024-03-07-github-actions-all-actions-will-run-on-node20-instead-of-node16-by-default/
Deprecation notice: v1, v2, and v3 of the artifact actions
The following artifacts were uploaded using a version of actions/upload-artifact that is scheduled for deprecation: "BackendTests-results-2.13", "build-fe-dist", "build-target", "CypressTests-results", "FrontendTests-results", "IntegrationTests-results-2.12", "IntegrationTests-results-2.13", "SlowTests-results-2.12". Please update your workflow to use v4 of the artifact actions. Learn more: https://github.blog/changelog/2024-04-16-deprecation-notice-v3-of-the-artifact-actions/

Artifacts

Produced during runtime
Name Size
BackendTests-results-2.13 Expired
2.46 MB
CypressTests-results Expired
24.3 KB
FrontendTests-results Expired
40.6 KB
IntegrationTests-results-2.12 Expired
81.7 KB
IntegrationTests-results-2.13 Expired
81.7 KB
SlowTests-results-2.12 Expired
515 KB
build-fe-dist Expired
14 MB
build-target Expired
83.2 MB